[Date Prev][Date Next][Thread Prev][Thread Next][Date Index][Thread Index]

Re: [ttylinux:121] No log for kernel build failure.



BruceFerjulian wrote:
> Missing is some useful information on why the build failed.
> 
> x86_64 linux-2.6.38.1 ...... g.b.Kernel FAILED.
> make: *** [kernel] Error 1
> The kernel is not built.
> make: *** [var/run/kernel] Error 1
> 
> 
> This is it, no logfile, nothing. Where would one start?
> 

Did you look for a log file in var/log ?