[Date Prev][Date Next][Thread Prev][Thread Next][Date Index][Thread Index]

Re: [ttylinux] fakeroot fail compile



This looks like a problem with something changing
after some of the compilation was done, and the rest
of the build process is confused.

If you want to try to build fakeroot by itself, outside
of the crosslinux makefile, then delete the build directory
and restart from ./configure

This was probably from trying to fix the problem
that crosslinux wants fakeroot-1.20 which is no
longer available. Make sure you have libpcap installed
on your host, then change lines 115 and 116 in
host-tools/Makefile.in to be

FAKEROOT_ZIP := fakeroot_1.20.1.orig.tar.bz2
FAKEROOT_DIR := fakeroot-1.20.1

I will update crosslinux in git as soon as I get
my own computer fixed....

On 08/11/14 08:30, Ferdinando Malgrati wrote:
I all,

trying to compile crosslinux i encountered a compile error.

is anybody face it?
how can I resolve it?

Regards
Ferdinando Malgrati

make  all-recursive
Making all in scripts
make[4]: Nothing to be done for `all'.
Making all in doc
Making all in de
make[5]: Nothing to be done for `all'.
Making all in es
make[5]: Nothing to be done for `all'.
Making all in fr
make[5]: Nothing to be done for `all'.
Making all in sv
make[5]: Nothing to be done for `all'.
Making all in nl
make[5]: Nothing to be done for `all'.
make[5]: Nothing to be done for `all-am'.
Making all in test
make[4]: Nothing to be done for `all'.
/bin/bash ./libtool  --tag=CC   --mode=compile gcc -DHAVE_CONFIG_H
-I.     -g -O2 -MT libfakeroot.lo -MD -MP -MF .deps/libfakeroot.Tpo -c
-o libfakeroot.lo libfakeroot.c
libtool: compile:  gcc -DHAVE_CONFIG_H -I. -g -O2 -MT libfakeroot.lo -MD
-MP -MF .deps/libfakeroot.Tpo -c libfakeroot.c  -fPIC -DPIC -o
.libs/libfakeroot.o
In file included from libfakeroot.c:223:
wrapped.h:126: error: expected ')' before 'hdrp'
In file included from libfakeroot.c:224:
wraptmpf.h:378: error: expected ')' before 'hdrp'
In file included from libfakeroot.c:225:
wrapdef.h:126: error: expected ')' before 'hdrp'
In file included from libfakeroot.c:226:
wrapstruct.h:127: error: 'next_capset' undeclared here (not in a
function)
libfakeroot.c:1565: error: expected ')' before 'hdrp'
libfakeroot.c: In function 'fts_read':
libfakeroot.c:1953: warning: passing argument 1 of 'send_get_stat64'
from incompatible pointer type
communicate.h:209: note: expected 'struct stat64 *' but argument is of
type 'struct stat *'
libfakeroot.c: In function 'fts_children':
libfakeroot.c:1976: warning: passing argument 1 of 'send_get_stat64'
from incompatible pointer type
communicate.h:209: note: expected 'struct stat64 *' but argument is of
type 'struct stat *'
make[4]: *** [libfakeroot.lo] Error 1
make[3]: *** [all-recursive] Error 1
make[2]: *** [all] Error 2